BDBM50164002 4-Benzenesulfonyl-4-(2-methoxy-phenyl)-piperidine-1-carboxylic acid ethyl ester::CHEMBL183806
SMILES CCOC(=O)N1CCC(CC1)(c1ccccc1OC)S(=O)(=O)c1ccccc1
InChI Key InChIKey=KSLWHCTXLQVVNC-UHFFFAOYSA-N
Data  1 EC50
  Tab Delimited (TSV)   2D SDfile   Computed 3D by Vconf -m prep SDfile
Find this compound or compounds like it in BindingDB:
Activity Spreadsheet -- Enzyme Inhibition Constant Data from BindingDB
Found 1 hit for monomerid = 50164002
TargetAmyloid-beta precursor protein(Homo sapiens (Human))
Wyeth Research
Curated by ChEMBL
LigandPNGBDBM50164002(4-Benzenesulfonyl-4-(2-methoxy-phenyl)-piperidine-...)
Affinity DataEC50:  6.27E+4nM. Assay description: In vitro effective concentration against beta amyloid protein 40 in ELISA
In DepthDetails ArticlePubMed